Reaction Details
TargetCarbonic anhydrase 5B, mitochondrial
LigandBDBM50449816
Substrate/Competitorn/a
Meas. Tech.ChEMBL_1740748 (CHEMBL4156498)
Kd 83±n/a nM
Citation Zak?auskas, A?apkauskait?, EJezep?ikas, LLinkuvien?, VKi?onait?, MSmirnov, AManakova, EGra?ulis, SMatulis, D Design of two-tail compounds with rotationally fixed benzenesulfonamide ring as inhibitors of carbonic anhydrases. Eur J Med Chem156:61-78 (2018) 
 
Carbonic anhydrase 5B, mitochondrial
Name:Carbonic anhydrase 5B, mitochondrial
Type:Enzyme
Mol. Mass.:36440.83
Organism:Homo sapiens (Human)
Description:Human (cloned) isozyme
Residue:317
BDBM50449816
NameBDBM50449816
Synonyms:CHEMBL4160149
TypeSmall organic molecule
Emp. Form.C11H14Cl2N2O3S
Mol. Mass.325.211
SMILESCCCCNC(=O)c1cc(c(Cl)cc1Cl)S(N)(=O)=O