Reaction Details
TargetCarbonic anhydrase 5B, mitochondrial
LigandBDBM50449809
Substrate/Competitorn/a
Meas. Tech.ChEMBL_1740748 (CHEMBL4156498)
Kd 250±n/a nM
Citation Zak?auskas, A?apkauskait?, EJezep?ikas, LLinkuvien?, VKi?onait?, MSmirnov, AManakova, EGra?ulis, SMatulis, D Design of two-tail compounds with rotationally fixed benzenesulfonamide ring as inhibitors of carbonic anhydrases. Eur J Med Chem156:61-78 (2018) 
 
Carbonic anhydrase 5B, mitochondrial
Name:Carbonic anhydrase 5B, mitochondrial
Type:Enzyme
Mol. Mass.:36440.83
Organism:Homo sapiens (Human)
Description:Human (cloned) isozyme
Residue:317
BDBM50449809
NameBDBM50449809
Synonyms:CHEMBL4168997
TypeSmall organic molecule
Emp. Form.C9H10Br2N2O4S
Mol. Mass.402.06
SMILESNS(=O)(=O)c1cc(C(=O)NCCO)c(Br)cc1Br