Reaction Details
TargetCarbonic anhydrase 5B, mitochondrial
LigandBDBM50449832
Substrate/Competitorn/a
Meas. Tech.ChEMBL_1740763 (CHEMBL4156513)
Kd 20±n/a nM
Citation Zak?auskas, A?apkauskait?, EJezep?ikas, LLinkuvien?, VKi?onait?, MSmirnov, AManakova, EGra?ulis, SMatulis, D Design of two-tail compounds with rotationally fixed benzenesulfonamide ring as inhibitors of carbonic anhydrases. Eur J Med Chem156:61-78 (2018) 
 
Carbonic anhydrase 5B, mitochondrial
Name:Carbonic anhydrase 5B, mitochondrial
Type:Enzyme
Mol. Mass.:36440.83
Organism:Homo sapiens (Human)
Description:Human (cloned) isozyme
Residue:317
BDBM50449832
NameBDBM50449832
Synonyms:CHEMBL4165543
TypeSmall organic molecule
Emp. Form.C16H24ClN3O4S
Mol. Mass.389.897
SMILESNS(=O)(=O)c1cc(C(=O)NCCCO)c(NC2CCCCC2)cc1Cl