Reaction Details
TargetMu-type opioid receptor
LigandBDBM50019480
Substrate/Competitorn/a
Meas. Tech.ChEBML_146984
IC50 2.8±n/a nM
Citation Gairin, JEMazarguil, HAlvinerie, PSaint-Pierre, SMeunier, JCCros, J Synthesis and biological activities of dynorphin A analogues with opioid antagonist properties. J Med Chem29:1913-7 (1986) Mu-type opioid receptor
Name:Mu-type opioid receptor
Type:Enzyme Catalytic Domain
Mol. Mass.:11165.58
Organism:GUINEA PIG
Description:P97266
Residue:98
BDBM50019480
NameBDBM50019480
Synonyms:CHEMBL2373009 | NH2-Tyr-Gly-Gly-Phe-Leu-Arg-Arg-D-Trp-Arg-D-Pro-Lys-OH
TypeSmall organic molecule
Emp. Form.C68H102N22O13
Mol. Mass.1435.6771
SMILESCC(C)C[C@H](NC(=O)[C@H](Cc1ccccc1)NC(=O)CNC(=O)CNC(=O)[C@@H](N)Cc1ccc(O)cc1)C(=O)N[C@@H](CCCN=C(N)N)C(=O)N[C@@H](CCCN=C(N)N)C(=O)N[C@H](Cc1c[nH]c2ccccc12)C(=O)N[C@@H](CCCN=C(N)N)C(=O)N1CCC[C@@H]1C(=O)N[C@@H](CCCCN)C(O)=O