Reaction Details
TargetKappa-type opioid receptor
LigandBDBM50452250
Substrate/Competitorn/a
Meas. Tech.ChEBML_146074
Ki 21±n/a nM
Citation Gairin, JEMazarguil, HAlvinerie, PSaint-Pierre, SMeunier, JCCros, J Synthesis and biological activities of dynorphin A analogues with opioid antagonist properties. J Med Chem29:1913-7 (1986) Kappa-type opioid receptor
Name:Kappa-type opioid receptor
Type:G Protein-Coupled Receptor (GPCR)
Mol. Mass.:42744.99
Organism:Cavia porcellus (domestic guinea pig)
Description:P41144
Residue:380
BDBM50452250
NameBDBM50452250
Synonyms:CHEMBL2373014
TypeSmall organic molecule
Emp. Form.C73H101N23O13
Mol. Mass.1508.7293
SMILESNCCCC[C@H](NC(=O)[C@H]1CCCN1C(=O)[C@H](CCCN=C(N)N)NC(=O)[C@@H](Cc1c[nH]c2ccccc12)NC(=O)[C@H](CCCN=C(N)N)NC(=O)[C@H](CCCN=C(N)N)NC(=O)[C@@H](Cc1c[nH]c2ccccc12)NC(=O)[C@H](Cc1ccccc1)NC(=O)CNC(=O)CNC(=O)[C@@H](N)Cc1ccc(O)cc1)C(O)=O