Reaction Details
TargetKappa-type opioid receptor
LigandBDBM50019483
Substrate/Competitorn/a
Meas. Tech.ChEBML_146074
Ki 73±n/a nM
Citation Gairin, JEMazarguil, HAlvinerie, PSaint-Pierre, SMeunier, JCCros, J Synthesis and biological activities of dynorphin A analogues with opioid antagonist properties. J Med Chem29:1913-7 (1986) Kappa-type opioid receptor
Name:Kappa-type opioid receptor
Type:G Protein-Coupled Receptor (GPCR)
Mol. Mass.:42744.99
Organism:Cavia porcellus (domestic guinea pig)
Description:P41144
Residue:380
BDBM50019483
NameBDBM50019483
Synonyms:CHEMBL2373008 | NH2-Tyr-Gly-D-Trp-Phe-Leu-Arg-Arg-D-Trp-Arg-D-Pro-Lys-OH
TypeSmall organic molecule
Emp. Form.C70H103N23O13
Mol. Mass.1474.7131
SMILESCC(C)C[C@H](NC(=O)[C@@H](Cc1c[nH]c2ccccc12)NC(=O)CNC(=O)CNC(=O)[C@@H](N)Cc1ccc(O)cc1)C(=O)N[C@@H](CCCN=C(N)N)C(=O)N[C@@H](CCCN=C(N)N)C(=O)N[C@H](Cc1c[nH]c2ccccc12)C(=O)N[C@@H](CCCN=C(N)N)C(=O)N1CCC[C@@H]1C(=O)N[C@@H](CCCCN)C(O)=O