Reaction Details
TargetAmiloride-sensitive amine oxidase [copper-containing]
LigandBDBM50020274
Substrate/Competitorn/a
Meas. Tech.ChEBML_53889
Ki 2700±n/a nM
Citation Kendrick, DADanzin, CKolb, M 2,2-Difluoro-5-hexyne-1,4-diamine: a potent enzyme-activated inhibitor of ornithine decarboxylase. J Med Chem32:170-3 (1989) Amiloride-sensitive amine oxidase [copper-containing]
Name:Amiloride-sensitive amine oxidase [copper-containing]
Type:Protein
Mol. Mass.:85387.64
Organism:Homo sapiens (Human)
Description:P19801
Residue:751
BDBM50020274
NameBDBM50020274
Synonyms:2,2-Difluoro-hex-5-yne-1,4-diamonium; dichloride | CHEMBL47011
TypeSmall organic molecule
Emp. Form.C6H12F2N2
Mol. Mass.150.1686
SMILES[NH3+]CC(F)(F)CC([NH3+])C#C