Reaction Details
Target3-beta-hydroxysteroid-Delta(8),Delta(7)-isomerase/7-dehydrocholesterol reductase
LigandBDBM50020285
Substrate/Competitorn/a
Meas. Tech.ChEBML_35744
IC50 22±n/a nM
Citation Ruenitz, PCArrendale, RFSchmidt, WFThompson, CBNanavati, NT Phenolic metabolites of clomiphene: [(E,Z)-2-[4-(1,2-diphenyl-2-chlorovinyl)phenoxy]ethyl]diethylamine. Preparation, electrophilicity, and effects in MCF 7 breast cancer cells. J Med Chem32:192-7 (1989) 3-beta-hydroxysteroid-Delta(8),Delta(7)-isomerase/7-dehydrocholesterol reductase
Name:3-beta-hydroxysteroid-Delta(8),Delta(7)-isomerase/7-dehydrocholesterol reductase
Synonyms:Anti-estrogen binding site (AEBS)
Type:n/a
Mol. Mass.:n/a
Description:ASSAY_ID of EBI is 35744
Components:This complex has 2 components.
Component 1
Name:3-beta-hydroxysteroid-Delta(8),Delta(7)-isomerase
Type:PROTEIN
Mol. Mass.:26358.51
Organism:Homo sapiens (Human)
Description:ChEMBL_873432
Residue:230
Component 2
Name:7-dehydrocholesterol reductase
Synonyms:7-DHC reductase Anti-estrogen binding site (AEBS) DHCR7 Putative sterol reductase SR-2 | Sterol Delta(7)-reductase
Type:PROTEIN
Mol. Mass.:54508.42
Organism:Homo sapiens (Human)
Description:ChEMBL_864350
Residue:475
BDBM50020285
NameBDBM50020285
Synonyms:3'-Methoxy-4'Hydroxyclomiphene CHEMBL955
TypeSmall organic molecule
Emp. Form.C27H30ClNO3
Mol. Mass.451.985
SMILESCCN(CC)CCOc1ccc(cc1)C(=C(\Cl)c1ccccc1)\c1ccc(O)c(OC)c1