Reaction Details
Target3-hydroxy-3-methylglutaryl-coenzyme A reductase
LigandBDBM50020290
Substrate/Competitorn/a
Meas. Tech.ChEBML_365
IC50 1.6±n/a nM
Citation Heathcock, CHDavis, BRHadley, CR Synthesis and biological evaluation of a monocyclic, fully functional analogue of compactin. J Med Chem32:197-202 (1989) 3-hydroxy-3-methylglutaryl-coenzyme A reductase
Name:3-hydroxy-3-methylglutaryl-coenzyme A reductase
Type:Enzyme
Mol. Mass.:96689.85
Organism:Rattus norvegicus (rat)
Description:Isolated rat liver microsomes were used as enzyme source.
Residue:887
BDBM50020290
NameBDBM50020290
Synonyms:7-[2,6-Dimethyl-8-(2-methyl-butyryloxy)-1,2,4a,5,6,7,8,8a-octahydro-naphthalen-1-yl]-3,5-dihydroxy-heptanoic acid | CHEMBL59166
TypeSmall organic molecule
Emp. Form.C24H40O6
Mol. Mass.424.5708
SMILESCC[C@H](C)C(=O)O[C@H]1C[C@@H](C)C[C@@H]2C=C[C@H](C)[C@H](CCC(O)C[C@@H](O)CC(O)=O)C12