Reaction Details
TargetPlasminogen activator inhibitor 1
LigandBDBM50454579
Substrate/Competitorn/a
Meas. Tech.ChEMBL_1752858 (CHEMBL4187618)
IC50 900±n/a nM
Citation Yamaoka, NMurano, KKodama, HMaeda, ADan, TNakabayashi, TMiyata, TMeguro, K Identification of novel plasminogen activator inhibitor-1 inhibitors with improved oral bioavailability: Structure optimization of N-acylanthranilic acid derivatives. Bioorg Med Chem Lett28:809-813 (2018) 
 
Plasminogen activator inhibitor 1
Name:Plasminogen activator inhibitor 1
Type:Enzyme
Mol. Mass.:45064.00
Organism:Homo sapiens (Human)
Description:P05121
Residue:402
BDBM50454579
NameBDBM50454579
Synonyms:CHEMBL4215648
TypeSmall organic molecule
Emp. Form.C24H16ClNO3
Mol. Mass.401.842
SMILESOC(=O)c1cc(Cl)ccc1NC(=O)c1cccc(c1)-c1cccc2ccccc12