Reaction Details
TargetPlasminogen activator inhibitor 1
LigandBDBM50454581
Substrate/Competitorn/a
Meas. Tech.ChEMBL_1752854 (CHEMBL4187614)
IC50 3550±n/a nM
Citation Yamaoka, NMurano, KKodama, HMaeda, ADan, TNakabayashi, TMiyata, TMeguro, K Identification of novel plasminogen activator inhibitor-1 inhibitors with improved oral bioavailability: Structure optimization of N-acylanthranilic acid derivatives. Bioorg Med Chem Lett28:809-813 (2018) 
 
Plasminogen activator inhibitor 1
Name:Plasminogen activator inhibitor 1
Type:Enzyme
Mol. Mass.:45064.00
Organism:Homo sapiens (Human)
Description:P05121
Residue:402
BDBM50454581
NameBDBM50454581
Synonyms:CHEMBL4205472
TypeSmall organic molecule
Emp. Form.C20H15ClN2O5
Mol. Mass.398.797
SMILESOC(=O)c1cc(Cl)ccc1NC(=O)C(=O)NCc1cccc(c1)-c1ccoc1