Reaction Details
TargetPlasminogen activator inhibitor 1
LigandBDBM50454585
Substrate/Competitorn/a
Meas. Tech.ChEMBL_1752858 (CHEMBL4187618)
IC50 4110±n/a nM
Citation Yamaoka, NMurano, KKodama, HMaeda, ADan, TNakabayashi, TMiyata, TMeguro, K Identification of novel plasminogen activator inhibitor-1 inhibitors with improved oral bioavailability: Structure optimization of N-acylanthranilic acid derivatives. Bioorg Med Chem Lett28:809-813 (2018) 
 
Plasminogen activator inhibitor 1
Name:Plasminogen activator inhibitor 1
Type:Enzyme
Mol. Mass.:45064.00
Organism:Homo sapiens (Human)
Description:P05121
Residue:402
BDBM50454585
NameBDBM50454585
Synonyms:CHEMBL4206161
TypeSmall organic molecule
Emp. Form.C21H14ClNO4
Mol. Mass.379.793
SMILESOC(=O)c1cc(Cl)ccc1NC(=O)c1ccc(cc1)C(=O)c1ccccc1