Reaction Details
TargetPlasminogen activator inhibitor 1
LigandBDBM50454591
Substrate/Competitorn/a
Meas. Tech.ChEMBL_1752858 (CHEMBL4187618)
IC50 1840±n/a nM
Citation Yamaoka, NMurano, KKodama, HMaeda, ADan, TNakabayashi, TMiyata, TMeguro, K Identification of novel plasminogen activator inhibitor-1 inhibitors with improved oral bioavailability: Structure optimization of N-acylanthranilic acid derivatives. Bioorg Med Chem Lett28:809-813 (2018) 
 
Plasminogen activator inhibitor 1
Name:Plasminogen activator inhibitor 1
Type:Enzyme
Mol. Mass.:45064.00
Organism:Homo sapiens (Human)
Description:P05121
Residue:402
BDBM50454591
NameBDBM50454591
Synonyms:CHEMBL4205662
TypeSmall organic molecule
Emp. Form.C23H14ClN2NaO3
Mol. Mass.424.812
SMILES[Na;v0+].[#8-]-[#6](=O)-c1cc(Cl)ccc1-[#7]-[#6](=O)-c1cccc(c1)-c1cccc2cnccc12