Reaction Details
Target5-hydroxytryptamine receptor 1B
LigandBDBM30707
Substrate/Competitorn/a
Meas. Tech.ChEBML_1802
Ki 350±n/a nM
Citation Glennon, RATiteler, MLyon, RASlusher, RM N,N-di-n-propylserotonin: binding at serotonin binding sites and a comparison with 8-hydroxy-2-(di-n-propylamino)tetralin. J Med Chem31:867-70 (1988) 5-hydroxytryptamine receptor 1B
Name:5-hydroxytryptamine receptor 1B
Type:Protein
Mol. Mass.:43173.33
Organism:Rattus norvegicus (Rat)
Description:P28564
Residue:386
BDBM30707
NameBDBM30707
Synonyms:2-(5-methoxy-1H-indol-3-yl)-N,N-dimethyl-ethanamine 2-(5-methoxy-1H-indol-3-yl)ethyl-dimethyl-amine CHEMBL7257 Methoxydimethyltryptamines WO2023019367, Compound 5-MeO-DMT | cid_1832
TypeSmall organic molecule
Emp. Form.C13H18N2O
Mol. Mass.218.2948
SMILESCOc1ccc2[nH]cc(CCN(C)C)c2c1