Reaction Details
Target5-hydroxytryptamine receptor 1A
LigandBDBM82087
Substrate/Competitorn/a
Meas. Tech.ChEBML_1318
Ki 3.2±n/a nM
Citation Glennon, RATiteler, MLyon, RASlusher, RM N,N-di-n-propylserotonin: binding at serotonin binding sites and a comparison with 8-hydroxy-2-(di-n-propylamino)tetralin. J Med Chem31:867-70 (1988) 5-hydroxytryptamine receptor 1A
Name:5-hydroxytryptamine receptor 1A
Type:G Protein-Coupled Receptor (GPCR)
Mol. Mass.:46445.29
Organism:Rattus norvegicus (rat)
Description:Binding assays were performed using rat hippocampal membranes.
Residue:422
BDBM82087
NameBDBM82087
Synonyms:2-(5-methoxy-1H-indol-3-yl)ethanamine 5-Methoxytryptamine hydrochloride tryptamine, 5-Methoxy
TypeSmall organic molecule
Emp. Form.C11H14N2O
Mol. Mass.190.2417
SMILESCOc1ccc2[nH]cc(CCN)c2c1