Reaction Details
TargetAdenosine receptor A2a/A2b
LigandBDBM50021087
Substrate/Competitorn/a
Meas. Tech.ChEMBL_27751 (CHEMBL641987)
Ki 20±n/a nM
Citation Jacobson, KAKirk, KLPadgett, WLDaly, JW Functionalized congeners of 1,3-dialkylxanthines: preparation of analogues with high affinity for adenosine receptors. J Med Chem28:1334-40 (1985) Adenosine receptor A2a/A2b
Name:Adenosine receptor A2a/A2b
Synonyms:Adenosine A2 receptor
Type:n/a
Mol. Mass.:n/a
Description:ASSAY_ID of ChEMBL is 329906
Components:This complex has 2 components.
Component 1
Name:Adenosine receptor A2b
Type:G Protein-Coupled Receptor (GPCR)
Mol. Mass.:36341.22
Organism:Homo sapiens (Human)
Description:n/a
Residue:332
Component 2
Name:Adenosine receptor A2a
Synonyms:A2A adenosine receptor (hA2A) ADENOSINE A2 ADORA2 Adenosine A2A receptor (A2AAR)
Type:G Protein-Coupled Receptor (GPCR)
Mol. Mass.:44716.46
Organism:Homo sapiens (Human)
Description:P29274
Residue:412
BDBM50021087
NameBDBM50021087
Synonyms:2-[4-(1,3-Dimethyl-2,6-dioxo-2,3,6,7-tetrahydro-1H-purin-8-yl)-phenoxy]-N-p-tolyl-acetamide CHEMBL441598
TypeSmall organic molecule
Emp. Form.C22H21N5O4
Mol. Mass.419.4332
SMILESCc1ccc(NC(=O)COc2ccc(cc2)-c2nc3n(C)c(=O)n(C)c(=O)c3[nH]2)cc1