Reaction Details
TargetAngiotensin-converting enzyme
LigandBDBM50021114
Substrate/Competitorn/a
Meas. Tech.ChEMBL_34933 (CHEMBL647678)
pH7.5±n/a
Ki 1.4±n/a nM
Commentsextracted
Citation Galardy, REGrobelny, D N alpha-(diphenoxyphosphoryl)-L-alanyl-L-proline, N alpha-[bis (4-nitrophenoxy)phosphoryl]-L-alanyl-L-proline, and N alpha-[ (2-phenylethyl)phenoxyphosphoryl]-L-alanyl-L-proline: releasers of potent inhibitors of angiotensin converting enzyme at physiological pH and temperature. J Med Chem28:1422-7 (1985) Angiotensin-converting enzyme
Name:Angiotensin-converting enzyme
Type:n/a
Mol. Mass.:150405.15
Organism:Oryctolagus cuniculus
Description:n/a
Residue:1310
BDBM50021114
NameBDBM50021114
Synonyms:CHEMBL282987 | tripotassium (2S)-1-[(2S)-2-(phosphonatoamino)propanoyl]pyrrolidine-2-carboxylate
TypeSmall organic molecule
Emp. Form.C8H12N2O6P
Mol. Mass.263.1661
SMILESC[C@H](NP([O-])([O-])=O)C(=O)N1CCC[C@H]1C([O-])=O