Reaction Details
TargetCarbonic anhydrase 2
LigandBDBM50457006
Substrate/Competitorn/a
Meas. Tech.ChEMBL_1758581 (CHEMBL4193589)
Ki 2.6±n/a nM
Citation Eldehna, WMAbo-Ashour, MFNocentini, AGratteri, PEissa, IHFares, MIsmael, OEGhabbour, HAElaasser, MMAbdel-Aziz, HASupuran, CT Novel 4/3-((4-oxo-5-(2-oxoindolin-3-ylidene)thiazolidin-2-ylidene)amino) benzenesulfonamides: Synthesis, carbonic anhydrase inhibitory activity, anticancer activity and molecular modelling studies. Eur J Med Chem139:250-262 (2017) 
 
Carbonic anhydrase 2
Name:Carbonic anhydrase 2
Type:Enzyme
Mol. Mass.:29250.71
Organism:Homo sapiens (Human)
Description:P00918
Residue:260
BDBM50457006
NameBDBM50457006
Synonyms:CHEMBL4211148
TypeSmall organic molecule
Emp. Form.C24H17ClN4O4S2
Mol. Mass.524.999
SMILESNS(=O)(=O)c1ccc(cc1)\N=C1/NC(=O)\C(S1)=C1\C(=O)N(Cc2ccccc2)c2ccc(Cl)cc12