Reaction Details
TargetPlatelet-activating factor receptor
LigandBDBM50021516
Substrate/Competitorn/a
Meas. Tech.ChEBML_151701
IC50 15000±n/a nM
Citation Biftu, TGamble, NFDoebber, THwang, SBShen, TYSnyder, JSpringer, JPStevenson, R Conformation and activity of tetrahydrofuran lignans and analogues as specific platelet activating factor antagonists. J Med Chem29:1917-21 (1986) Platelet-activating factor receptor
Name:Platelet-activating factor receptor
Type:Protein
Mol. Mass.:39005.63
Organism:Cavia porcellus
Description:n/a
Residue:342
BDBM50021516
NameBDBM50021516
Synonyms:2,5-Bis-(3,4,5-trimethoxy-phenyl)-tetrahydro-furan | CHEMBL291332
TypeSmall organic molecule
Emp. Form.C22H28O7
Mol. Mass.404.4535
SMILESCOc1cc(cc(OC)c1OC)C1CC[C@@H](O1)c1cc(OC)c(OC)c(OC)c1