Reaction Details
TargetPlatelet-activating factor receptor
LigandBDBM50002831
Substrate/Competitorn/a
Meas. Tech.ChEBML_151701
IC50 20±n/a nM
Citation Biftu, TGamble, NFDoebber, THwang, SBShen, TYSnyder, JSpringer, JPStevenson, R Conformation and activity of tetrahydrofuran lignans and analogues as specific platelet activating factor antagonists. J Med Chem29:1917-21 (1986) Platelet-activating factor receptor
Name:Platelet-activating factor receptor
Type:Protein
Mol. Mass.:39005.63
Organism:Cavia porcellus
Description:n/a
Residue:342
BDBM50002831
NameBDBM50002831
Synonyms:(2R,5R)-2,5-Bis-(3,4,5-trimethoxy-phenyl)-tetrahydro-furan (E)-(1R,2R,3R,5R,12S,13R,16S)-16-Hydroxymethyl-5,9,12,13-tetramethyl-4-oxa-tricyclo[10.3.1.0*3,5*]hexadec-8-en-2-ol 2,5-Bis-(3,4,5-trimethoxy-phenyl)-tetrahydro-furan 2,5-Bis-(3,4,5-trimethoxy-phenyl)-tetrahydro-furan(L-652731) L-652731
TypeSmall organic molecule
Emp. Form.C22H28O7
Mol. Mass.404.4535
SMILESCOc1cc(cc(OC)c1OC)[C@@H]1CC[C@H](O1)c1cc(OC)c(OC)c(OC)c1