Reaction Details
TargetPlatelet-activating factor receptor
LigandBDBM50021521
Substrate/Competitorn/a
Meas. Tech.ChEBML_151701
IC50 200±n/a nM
Citation Biftu, TGamble, NFDoebber, THwang, SBShen, TYSnyder, JSpringer, JPStevenson, R Conformation and activity of tetrahydrofuran lignans and analogues as specific platelet activating factor antagonists. J Med Chem29:1917-21 (1986) Platelet-activating factor receptor
Name:Platelet-activating factor receptor
Type:Protein
Mol. Mass.:39005.63
Organism:Cavia porcellus
Description:n/a
Residue:342
BDBM50021521
NameBDBM50021521
Synonyms:2,5-Bis-(3,4-dimethoxy-phenyl)-3,4-dimethyl-tetrahydro-furan | CHEMBL56856
TypeSmall organic molecule
Emp. Form.C22H28O5
Mol. Mass.372.4547
SMILESCOc1ccc(cc1OC)C1O[C@H]([C@@H](C)[C@H]1C)c1ccc(OC)c(OC)c1