Reaction Details
TargetPlatelet-activating factor receptor
LigandBDBM50021520
Substrate/Competitorn/a
Meas. Tech.ChEBML_151701
IC50 500±n/a nM
Citation Biftu, TGamble, NFDoebber, THwang, SBShen, TYSnyder, JSpringer, JPStevenson, R Conformation and activity of tetrahydrofuran lignans and analogues as specific platelet activating factor antagonists. J Med Chem29:1917-21 (1986) Platelet-activating factor receptor
Name:Platelet-activating factor receptor
Type:Protein
Mol. Mass.:39005.63
Organism:Cavia porcellus
Description:n/a
Residue:342
BDBM50021520
NameBDBM50021520
Synonyms:2,5-Bis-(3,4-dimethoxy-phenyl)-tetrahydro-furan | CHEMBL291668
TypeSmall organic molecule
Emp. Form.C20H24O5
Mol. Mass.344.4016
SMILESCOc1ccc(cc1OC)[C@H]1CC[C@@H](O1)c1ccc(OC)c(OC)c1