Reaction Details
TargetReduced folate transporter
LigandBDBM50457431
Substrate/Competitorn/a
Meas. Tech.ChEMBL_1759619 (CHEMBL4194627)
IC50>1000±n/a nM
Citation Ravindra, MWallace-Povirk, AKarim, MAWilson, MRO'Connor, CWhite, KKushner, JPolin, LGeorge, CHou, ZMatherly, LHGangjee, A Tumor Targeting with Novel Pyridyl 6-Substituted Pyrrolo[2,3- d]Pyrimidine Antifolates via Cellular Uptake by Folate Receptor ? and the Proton-Coupled Folate Transporter and Inhibition of De Novo Purine Nucleotide Biosynthesis. J Med Chem61:2027-2040 (2018) 
 
Reduced folate transporter
Name:Reduced folate transporter
Type:PROTEIN
Mol. Mass.:64885.16
Organism:Homo sapiens (Human)
Description:ChEMBL_1469594
Residue:591
BDBM50457431
NameBDBM50457431
Synonyms:CHEMBL4218109
TypeSmall organic molecule
Emp. Form.C21H20N6O6
Mol. Mass.452.4201
SMILESNc1nc2[nH]c(CCC#Cc3ccc(cn3)C(=O)N[C@@H](CCC(O)=O)C(O)=O)cc2c(=O)[nH]1