Reaction Details
TargetReduced folate transporter
LigandBDBM50457437
Substrate/Competitorn/a
Meas. Tech.ChEMBL_1759619 (CHEMBL4194627)
IC50 0.690000±n/a nM
Citation Ravindra, MWallace-Povirk, AKarim, MAWilson, MRO'Connor, CWhite, KKushner, JPolin, LGeorge, CHou, ZMatherly, LHGangjee, A Tumor Targeting with Novel Pyridyl 6-Substituted Pyrrolo[2,3- d]Pyrimidine Antifolates via Cellular Uptake by Folate Receptor ? and the Proton-Coupled Folate Transporter and Inhibition of De Novo Purine Nucleotide Biosynthesis. J Med Chem61:2027-2040 (2018) 
 
Reduced folate transporter
Name:Reduced folate transporter
Type:PROTEIN
Mol. Mass.:64885.16
Organism:Homo sapiens (Human)
Description:ChEMBL_1469594
Residue:591
BDBM50457437
NameBDBM50457437
Synonyms:CHEBI:71223 PDX | Pralatrexate
TypeSmall organic molecule
Emp. Form.C23H23N7O5
Mol. Mass.477.4726
SMILES[H][C@@](CCC(O)=O)(NC(=O)c1ccc(cc1)C(CC#C)Cc1cnc2nc(N)nc(N)c2n1)C(O)=O