Reaction Details
TargetSerine/threonine-protein kinase B-raf
LigandBDBM50457452
Substrate/Competitorn/a
Meas. Tech.ChEMBL_1759726 (CHEMBL4194734)
IC50 0.160000±n/a nM
Citation Agianian, BGavathiotis, E Current Insights of BRAF Inhibitors in Cancer. J Med Chem61:5775-5793 (2018) 
 
Serine/threonine-protein kinase B-raf
Name:Serine/threonine-protein kinase B-raf
Type:Serine/threonine-protein kinase
Mol. Mass.:84446.00
Organism:Homo sapiens (Human)
Description:P15056
Residue:766
BDBM50457452
NameBDBM50457452
Synonyms:SB-590885 | SB590885
TypeSmall organic molecule
Emp. Form.C27H27N5O2
Mol. Mass.453.5356
SMILESCN(C)CCOc1ccc(cc1)-c1nc(c([nH]1)-c1ccc2\C(CCc2c1)=N\O)-c1ccncc1