Reaction Details
TargetSerine/threonine-protein kinase B-raf
LigandBDBM50029085
Substrate/Competitorn/a
Meas. Tech.ChEMBL_1759729 (CHEMBL4194737)
IC50 0.170000±n/a nM
Citation Agianian, BGavathiotis, E Current Insights of BRAF Inhibitors in Cancer. J Med Chem61:5775-5793 (2018) 
 
Serine/threonine-protein kinase B-raf
Name:Serine/threonine-protein kinase B-raf
Type:Serine/threonine-protein kinase
Mol. Mass.:84446.00
Organism:Homo sapiens (Human)
Description:P15056
Residue:766
BDBM50029085
NameBDBM50029085
Synonyms:CHEBI:83405 GDC-0879
TypeSmall organic molecule
Emp. Form.C19H18N4O2
Mol. Mass.334.3718
SMILESOCCn1cc(c(n1)-c1ccncc1)-c1ccc2\C(CCc2c1)=N\O