Reaction Details
TargetAminopeptidase B
LigandBDBM50457479
Substrate/Competitorn/a
Meas. Tech.ChEMBL_1759799 (CHEMBL4194807)
Ki 1000±n/a nM
Citation Amin, SAAdhikari, NJha, T Design of Aminopeptidase N Inhibitors as Anti-cancer Agents. J Med Chem61:6468-6490 (2018) 
 
Aminopeptidase B
Name:Aminopeptidase B
Type:PROTEIN
Mol. Mass.:72609.93
Organism:Rattus norvegicus
Description:ChEMBL_1344423
Residue:650
BDBM50457479
NameBDBM50457479
Synonyms:CHEMBL1159812
TypeSmall organic molecule
Emp. Form.C5H13NS2
Mol. Mass.151.293
SMILESCSCCC(N)CS