Reaction Details
TargetOpioid receptor delta 1
LigandBDBM50101160
Substrate/Competitorn/a
Meas. Tech.ChEMBL_1762407 (CHEMBL4197654)
Ki 8.3±n/a nM
Citation Turnaturi, RMarrazzo, AParenti, CPasquinucci, L Benzomorphan scaffold for opioid analgesics and pharmacological tools development: A comprehensive review. Eur J Med Chem148:410-422 (2018) 
 
Opioid receptor delta 1
Name:Opioid receptor delta 1
Type:PROTEIN
Mol. Mass.:40087.02
Organism:Cavia porcellus
Description:ChEMBL_117772
Residue:366
BDBM50101160
NameBDBM50101160
Synonyms:3-Cyclopropylmethyl-6,11-dimethyl-1,2,3,4,5,6-hexahydro-2,6-methano-benzo[d]azocine-8-carboxylic acid amide | CHEMBL297428
TypeSmall organic molecule
Emp. Form.C19H26N2O
Mol. Mass.298.4225
SMILESCC1C2Cc3ccc(cc3C1(C)CCN2CC1CC1)C(N)=O