Reaction Details
TargetMu-type opioid receptor
LigandBDBM50101160
Substrate/Competitorn/a
Meas. Tech.ChEMBL_1762404 (CHEMBL4197651)
EC50 4.9±n/a nM
Citation Turnaturi, RMarrazzo, AParenti, CPasquinucci, L Benzomorphan scaffold for opioid analgesics and pharmacological tools development: A comprehensive review. Eur J Med Chem148:410-422 (2018) 
 
Mu-type opioid receptor
Name:Mu-type opioid receptor
Type:G Protein-Coupled Receptor (GPCR)
Mol. Mass.:44789.51
Organism:Homo sapiens (Human)
Description:P35372
Residue:400
BDBM50101160
NameBDBM50101160
Synonyms:3-Cyclopropylmethyl-6,11-dimethyl-1,2,3,4,5,6-hexahydro-2,6-methano-benzo[d]azocine-8-carboxylic acid amide | CHEMBL297428
TypeSmall organic molecule
Emp. Form.C19H26N2O
Mol. Mass.298.4225
SMILESCC1C2Cc3ccc(cc3C1(C)CCN2CC1CC1)C(N)=O