Reaction Details
TargetMu-type opioid receptor
LigandBDBM50101160
Substrate/Competitorn/a
Meas. Tech.ChEMBL_1762406 (CHEMBL4197653)
Ki 0.410000±n/a nM
Citation Turnaturi, RMarrazzo, AParenti, CPasquinucci, L Benzomorphan scaffold for opioid analgesics and pharmacological tools development: A comprehensive review. Eur J Med Chem148:410-422 (2018) 
 
Mu-type opioid receptor
Name:Mu-type opioid receptor
Type:Enzyme Catalytic Domain
Mol. Mass.:11165.58
Organism:GUINEA PIG
Description:P97266
Residue:98
BDBM50101160
NameBDBM50101160
Synonyms:3-Cyclopropylmethyl-6,11-dimethyl-1,2,3,4,5,6-hexahydro-2,6-methano-benzo[d]azocine-8-carboxylic acid amide | CHEMBL297428
TypeSmall organic molecule
Emp. Form.C19H26N2O
Mol. Mass.298.4225
SMILESCC1C2Cc3ccc(cc3C1(C)CCN2CC1CC1)C(N)=O