Reaction Details
TargetThromboxane-A synthase
LigandBDBM50022120
Substrate/Competitorn/a
Meas. Tech.ChEBML_213092
IC50 25.0±n/a nM
Citation Cross, PEDickinson, RPParry, MJRandall, MJ Selective thromboxane synthetase inhibitors. 2. 3-(1H-imidazol-1-ylmethyl)-2-methyl-1H-indole-1-propanoic acid and analogues. J Med Chem29:342-6 (1986) Thromboxane-A synthase
Name:Thromboxane-A synthase
Type:Enzyme
Mol. Mass.:60524.67
Organism:Homo sapiens (Human)
Description:P24557
Residue:533
BDBM50022120
NameBDBM50022120
Synonyms:3-Imidazol-1-ylmethyl-1H-indole | CHEMBL116794
TypeSmall organic molecule
Emp. Form.C12H11N3
Mol. Mass.197.2358
SMILESC(c1c[nH]c2ccccc12)n1ccnc1