Reaction Details
TargetDNA topoisomerase 3
LigandBDBM50022146
Substrate/Competitorn/a
Meas. Tech.ChEMBL_54521 (CHEMBL663868)
Ki 9000±n/a nM
Citation Trantolo, DJWright, GEBrown, NC Inhibitors of Bacillus subtilis DNA polymerase III. Influence of modifications in the pyrimidine ring of anilino- and (benzylamino)pyrimidines. J Med Chem29:676-81 (1986) DNA topoisomerase 3
Name:DNA topoisomerase 3
Type:PROTEIN
Mol. Mass.:81515.22
Organism:Bacillus subtilis
Description:ChEMBL_54525
Residue:727
BDBM50022146
NameBDBM50022146
Synonyms:6-Benzylamino-5-bromo-1H-pyrimidine-2,4-dione | CHEMBL161517
TypeSmall organic molecule
Emp. Form.C11H10BrN3O2
Mol. Mass.296.12
SMILESBrc1c(NCc2ccccc2)[nH]c(=O)[nH]c1=O