Reaction Details
TargetDNA topoisomerase 3
LigandBDBM50022167
Substrate/Competitorn/a
Meas. Tech.ChEBML_54514
Ki 2000±n/a nM
Citation Trantolo, DJWright, GEBrown, NC Inhibitors of Bacillus subtilis DNA polymerase III. Influence of modifications in the pyrimidine ring of anilino- and (benzylamino)pyrimidines. J Med Chem29:676-81 (1986) DNA topoisomerase 3
Name:DNA topoisomerase 3
Type:PROTEIN
Mol. Mass.:81515.22
Organism:Bacillus subtilis
Description:ChEMBL_54525
Residue:727
BDBM50022167
NameBDBM50022167
Synonyms:2-Amino-6-(indan-5-ylamino)-3H-pyrimidin-4-one | CHEMBL349592
TypeSmall organic molecule
Emp. Form.C13H14N4O
Mol. Mass.242.2765
SMILESNc1nc(Nc2ccc3CCCc3c2)cc(=O)[nH]1