Reaction Details
TargetMacrophage migration inhibitory factor
LigandBDBM50458540
Substrate/Competitorn/a
Meas. Tech.ChEMBL_1764062 (CHEMBL4199309)
Kd 55100±n/a nM
Citation Trivedi-Parmar, VJorgensen, WL Advances and Insights for Small Molecule Inhibition of Macrophage Migration Inhibitory Factor. J Med Chem61:8104-8119 (2018) 
 
Macrophage migration inhibitory factor
Name:Macrophage migration inhibitory factor
Type:Enzyme
Mol. Mass.:12478.18
Organism:Homo sapiens (Human)
Description:P14174
Residue:115
BDBM50458540
NameBDBM50458540
Synonyms:CHEMBL4204890
TypeSmall organic molecule
Emp. Form.C15H20N2O
Mol. Mass.244.3321
SMILESCC(C)CC(=O)c1c(nn2ccccc12)C(C)C