Reaction Details
TargetPepsin A
LigandBDBM50022289
Substrate/Competitorn/a
Meas. Tech.ChEBML_222285
Ki>1000±n/a nM
Citation Salituro, FGAgarwal, NHofmann, TRich, DH Inhibition of aspartic proteinases by peptides containing lysine and ornithine side-chain analogues of statine. J Med Chem30:286-95 (1987) Pepsin A
Name:Pepsin A
Type:Enzyme
Mol. Mass.:41232.87
Organism:Porcine
Description:n/a
Residue:385
BDBM50022289
NameBDBM50022289
Synonyms:Acetate6-ethoxycarbonyl-5-hydroxy-4-{3-methyl-2-[3-methyl-2-(3-methyl-butyrylamino)-butyrylamino]-butyrylamino}-hexyl-ammonium; | CHEMBL319016
TypeSmall organic molecule
Emp. Form.C24H47N4O6
Mol. Mass.487.6526
SMILESCCOC(=O)CC(O)[C@H](CCC[NH3+])NC(=O)[C@H](NC(=O)C(NC(=O)CC(C)C)C(C)C)C(C)C