Reaction Details
TargetTyrosine-protein kinase Tec
LigandBDBM50458604
Substrate/Competitorn/a
Meas. Tech.ChEMBL_1764259 (CHEMBL4199506)
IC50 0.110000±n/a nM
Citation Blass, BE Covalent Inhibitors of the TEC Family of Kinases and Their Methods of Use. ACS Med Chem Lett9:587-589 (2018) 
 
Tyrosine-protein kinase Tec
Name:Tyrosine-protein kinase Tec
Type:Protein
Mol. Mass.:73597.00
Organism:Homo sapiens (Human)
Description:n/a
Residue:631
BDBM50458604
NameBDBM50458604
Synonyms:CHEMBL4214683 | US10752615, Compound 149
TypeSmall organic molecule
Emp. Form.C27H26N6O2S
Mol. Mass.498.599
SMILESCc1nccc(n1)-c1ccc(s1)C(=O)Nc1nc2ccccc2n1[C@H]1C[C@]2(C1)CCN(C2)C(=O)C=C