Reaction Details
TargetMelatonin receptor type 1A
LigandBDBM50458976
Substrate/Competitorn/a
Meas. Tech.ChEMBL_1765186 (CHEMBL4200433)
Ki 4.9±n/a nM
Citation Spadoni, GBedini, AFuriassi, LMari, MMor, MScalvini, LLodola, AGhidini, ALucini, VDugnani, SScaglione, FPiomelli, DJung, KMSupuran, CTLucarini, LDurante, MSgambellone, SMasini, ERivara, S Identification of Bivalent Ligands with Melatonin Receptor Agonist and Fatty Acid Amide Hydrolase (FAAH) Inhibitory Activity That Exhibit Ocular Hypotensive Effect in the Rabbit. J Med Chem61:7902-7916 (2018) 
 
Melatonin receptor type 1A
Name:Melatonin receptor type 1A
Type:Enzyme
Mol. Mass.:39392.94
Organism:Homo sapiens (Human)
Description:P48039
Residue:350
BDBM50458976
NameBDBM50458976
Synonyms:CHEMBL4202816
TypeSmall organic molecule
Emp. Form.C33H39N3O4
Mol. Mass.541.6805
SMILESCC(=O)NCCc1c[nH]c2ccc(OCCCCCCCCNC(=O)Oc3cccc(c3)-c3ccccc3)cc12