Reaction Details
TargetMelatonin receptor type 1A
LigandBDBM50458978
Substrate/Competitorn/a
Meas. Tech.ChEMBL_1765186 (CHEMBL4200433)
Ki 6.0±n/a nM
Citation Spadoni, GBedini, AFuriassi, LMari, MMor, MScalvini, LLodola, AGhidini, ALucini, VDugnani, SScaglione, FPiomelli, DJung, KMSupuran, CTLucarini, LDurante, MSgambellone, SMasini, ERivara, S Identification of Bivalent Ligands with Melatonin Receptor Agonist and Fatty Acid Amide Hydrolase (FAAH) Inhibitory Activity That Exhibit Ocular Hypotensive Effect in the Rabbit. J Med Chem61:7902-7916 (2018) 
 
Melatonin receptor type 1A
Name:Melatonin receptor type 1A
Type:Enzyme
Mol. Mass.:39392.94
Organism:Homo sapiens (Human)
Description:P48039
Residue:350
BDBM50458978
NameBDBM50458978
Synonyms:CHEMBL4214478
TypeSmall organic molecule
Emp. Form.C31H35N3O4
Mol. Mass.513.6273
SMILESCC(=O)NCCc1c[nH]c2ccc(OCCCCCCNC(=O)Oc3cccc(c3)-c3ccccc3)cc12