Reaction Details
TargetMelatonin receptor type 1B
LigandBDBM50458979
Substrate/Competitorn/a
Meas. Tech.ChEMBL_1765188 (CHEMBL4200435)
Ki 1.7±n/a nM
Citation Spadoni, GBedini, AFuriassi, LMari, MMor, MScalvini, LLodola, AGhidini, ALucini, VDugnani, SScaglione, FPiomelli, DJung, KMSupuran, CTLucarini, LDurante, MSgambellone, SMasini, ERivara, S Identification of Bivalent Ligands with Melatonin Receptor Agonist and Fatty Acid Amide Hydrolase (FAAH) Inhibitory Activity That Exhibit Ocular Hypotensive Effect in the Rabbit. J Med Chem61:7902-7916 (2018) 
 
Melatonin receptor type 1B
Name:Melatonin receptor type 1B
Type:Enzyme
Mol. Mass.:40203.54
Organism:Homo sapiens (Human)
Description:P49286
Residue:362
BDBM50458979
NameBDBM50458979
Synonyms:CHEMBL4210086
TypeSmall organic molecule
Emp. Form.C31H34BrN3O4
Mol. Mass.592.523
SMILESCC(=O)NCCc1c(Br)[nH]c2ccc(OCCCCCCNC(=O)Oc3cccc(c3)-c3ccccc3)cc12