Reaction Details
TargetCytochrome P450 1A2
LigandBDBM50459192
Substrate/Competitorn/a
Meas. Tech.ChEMBL_1765744 (CHEMBL4200991)
IC50 2800±n/a nM
Citation Bardiot, DKoukni, MSmets, WCarlens, GMcNaughton, MKaptein, SDallmeier, KChaltin, PNeyts, JMarchand, A Discovery of Indole Derivatives as Novel and Potent Dengue Virus Inhibitors. J Med Chem61:8390-8401 (2018) 
 
Cytochrome P450 1A2
Name:Cytochrome P450 1A2
Type:Enzyme
Mol. Mass.:58423.38
Organism:Homo sapiens (Human)
Description:P05177
Residue:516
BDBM50459192
NameBDBM50459192
Synonyms:CHEMBL4205724
TypeSmall organic molecule
Emp. Form.C22H19N3O2
Mol. Mass.357.4052
SMILESCOc1cncc(NC(C(=O)c2c[nH]c3ccccc23)c2ccccc2)c1