Reaction Details
TargetCytochrome P450 2C19
LigandBDBM50459192
Substrate/Competitorn/a
Meas. Tech.ChEMBL_1765745 (CHEMBL4200992)
IC50 2500±n/a nM
Citation Bardiot, DKoukni, MSmets, WCarlens, GMcNaughton, MKaptein, SDallmeier, KChaltin, PNeyts, JMarchand, A Discovery of Indole Derivatives as Novel and Potent Dengue Virus Inhibitors. J Med Chem61:8390-8401 (2018) 
 
Cytochrome P450 2C19
Name:Cytochrome P450 2C19
Type:Enzyme
Mol. Mass.:55935.47
Organism:Homo sapiens (Human)
Description:P33261
Residue:490
BDBM50459192
NameBDBM50459192
Synonyms:CHEMBL4205724
TypeSmall organic molecule
Emp. Form.C22H19N3O2
Mol. Mass.357.4052
SMILESCOc1cncc(NC(C(=O)c2c[nH]c3ccccc23)c2ccccc2)c1