Reaction Details
TargetCytochrome P450 2C19
LigandBDBM50459193
Substrate/Competitorn/a
Meas. Tech.ChEMBL_1765745 (CHEMBL4200992)
IC50 2300±n/a nM
Citation Bardiot, DKoukni, MSmets, WCarlens, GMcNaughton, MKaptein, SDallmeier, KChaltin, PNeyts, JMarchand, A Discovery of Indole Derivatives as Novel and Potent Dengue Virus Inhibitors. J Med Chem61:8390-8401 (2018) 
 
Cytochrome P450 2C19
Name:Cytochrome P450 2C19
Type:Enzyme
Mol. Mass.:55935.47
Organism:Homo sapiens (Human)
Description:P33261
Residue:490
BDBM50459193
NameBDBM50459193
Synonyms:CHEMBL4212403
TypeSmall organic molecule
Emp. Form.C24H22N2O3
Mol. Mass.386.4431
SMILESCOc1cc(NC(C(=O)c2c[nH]c3ccccc23)c2ccccc2)cc(OC)c1