Reaction Details
TargetCytochrome P450 2C9
LigandBDBM50459194
Substrate/Competitorn/a
Meas. Tech.ChEMBL_1765746 (CHEMBL4200993)
IC50 3100±n/a nM
Citation Bardiot, DKoukni, MSmets, WCarlens, GMcNaughton, MKaptein, SDallmeier, KChaltin, PNeyts, JMarchand, A Discovery of Indole Derivatives as Novel and Potent Dengue Virus Inhibitors. J Med Chem61:8390-8401 (2018) 
 
Cytochrome P450 2C9
Name:Cytochrome P450 2C9
Type:Enzyme
Mol. Mass.:55636.33
Organism:Homo sapiens (Human)
Description:P11712
Residue:490
BDBM50459194
NameBDBM50459194
Synonyms:CHEMBL4203293
TypeSmall organic molecule
Emp. Form.C25H24N2O4
Mol. Mass.416.4691
SMILESCOc1cc(NC(C(=O)c2c[nH]c3ccccc23)c2ccccc2)cc(OCCO)c1