Reaction Details
TargetCytochrome P450 3A4
LigandBDBM50459192
Substrate/Competitorn/a
Meas. Tech.ChEMBL_1765748 (CHEMBL4200995)
IC50 50±n/a nM
Citation Bardiot, DKoukni, MSmets, WCarlens, GMcNaughton, MKaptein, SDallmeier, KChaltin, PNeyts, JMarchand, A Discovery of Indole Derivatives as Novel and Potent Dengue Virus Inhibitors. J Med Chem61:8390-8401 (2018) 
 
Cytochrome P450 3A4
Name:Cytochrome P450 3A4
Type:Enzyme
Mol. Mass.:57349.57
Organism:Homo sapiens (Human)
Description:n/a
Residue:503
BDBM50459192
NameBDBM50459192
Synonyms:CHEMBL4205724
TypeSmall organic molecule
Emp. Form.C22H19N3O2
Mol. Mass.357.4052
SMILESCOc1cncc(NC(C(=O)c2c[nH]c3ccccc23)c2ccccc2)c1