Reaction Details
TargetBeta-lactamase TEM
LigandBDBM50022785
Substrate/Competitorn/a
Meas. Tech.ChEBML_40718
Ki 10000±n/a nM
Citation Joyeau, RMolines, HLabia, RWakselman, M N-aryl 3-halogenated azetidin-2-ones and benzocarbacephems, inhibitors of beta-lactamases. J Med Chem31:370-4 (1988) Beta-lactamase TEM
Name:Beta-lactamase TEM
Type:Enzyme
Mol. Mass.:31512.33
Organism:Escherichia coli
Description:P62593
Residue:286
BDBM50022785
NameBDBM50022785
Synonyms:4-Methyl-3-(2-oxo-azetidin-1-yl)-benzoic acid | CHEMBL124880
TypeSmall organic molecule
Emp. Form.C11H11NO3
Mol. Mass.205.2099
SMILESCc1ccc(cc1N1CCC1=O)C(O)=O