Reaction Details
TargetBeta-lactamase TEM
LigandBDBM50022789
Substrate/Competitorn/a
Meas. Tech.ChEBML_40718
Ki 39000±n/a nM
Citation Joyeau, RMolines, HLabia, RWakselman, M N-aryl 3-halogenated azetidin-2-ones and benzocarbacephems, inhibitors of beta-lactamases. J Med Chem31:370-4 (1988) Beta-lactamase TEM
Name:Beta-lactamase TEM
Type:Enzyme
Mol. Mass.:31512.33
Organism:Escherichia coli
Description:P62593
Residue:286
BDBM50022789
NameBDBM50022789
Synonyms:4-Fluoro-1-oxo-2,2a,3,4-tetrahydro-1H-azeto[1,2-a]quinoline-7-carboxylic acid | CHEMBL125658
TypeSmall organic molecule
Emp. Form.C12H10FNO3
Mol. Mass.235.2111
SMILESOC(=O)c1ccc2C(F)CC3CC(=O)N3c2c1