Reaction Details
TargetGamma-aminobutyric acid receptor subunit alpha-1
LigandBDBM50459891
Substrate/Competitorn/a
Meas. Tech.ChEMBL_1767464 (CHEMBL4219576)
EC50 15000±n/a nM
Citation Sparling, BADiMauro, EF Progress in the discovery of small molecule modulators of the Cys-loop superfamily receptors. Bioorg Med Chem Lett27:3207-3218 (2017) 
 
Gamma-aminobutyric acid receptor subunit alpha-1
Name:Gamma-aminobutyric acid receptor subunit alpha-1
Type:Enzyme
Mol. Mass.:51770.21
Organism:Rattus norvegicus (Rat)
Description:P62813
Residue:455
BDBM50459891
NameBDBM50459891
Synonyms:CHEMBL4229086
TypeSmall organic molecule
Emp. Form.C17H17F2NO2
Mol. Mass.305.3192
SMILESCCCCNC(=O)c1cc(ccc1O)-c1ccc(F)cc1F