Reaction Details
TargetRenin
LigandBDBM50023090
Substrate/Competitorn/a
Meas. Tech.ChEMBL_196266 (CHEMBL803243)
Ki 97±n/a nM
Citation Bock, MGDiPardo, RMEvans, BERittle, KEBoger, JPoe, MLaMont, BILynch, RJUlm, EHVlasuk, GP Renin inhibitors. Statine-containing tetrapeptides with varied hydrophobic carboxy termini. J Med Chem30:1853-7 (1987) Renin
Name:Renin
Type:Enzyme
Mol. Mass.:45058.99
Organism:Homo sapiens (Human)
Description:n/a
Residue:406
BDBM50023090
NameBDBM50023090
Synonyms:Boc-Phe-His-Sta-Leu-4-amido-1-benzylpiperidine | CHEMBL54411
TypeSmall organic molecule
Emp. Form.C46H68N8O7
Mol. Mass.845.0815
SMILESCC(C)CC(NC(=O)[C@H](Cc1cnc[nH]1)NC(=O)[C@H](Cc1ccccc1)NC(=O)OC(C)(C)C)C(O)CC(=O)N[C@@H](CC(C)C)C(=O)NC1CCN(Cc2ccccc2)CC1