Reaction Details
TargetGamma-hydroxybutyrate receptor
LigandBDBM50023573
Substrate/Competitorn/a
Meas. Tech.ChEBML_68885
IC50 3.3±n/a nM
Citation Bourguignon, JJSchoenfelder, ASchmitt, MWermuth, CGHechler, VCharlier, BMaitre, M Analogues of gamma-hydroxybutyric acid. Synthesis and binding studies. J Med Chem31:893-7 (1988) Gamma-hydroxybutyrate receptor
Name:Gamma-hydroxybutyrate receptor
Type:Enzyme Catalytic Domain
Mol. Mass.:56171.11
Organism:RAT
Description:Gamma hydroxybutyric, GHB 0 RAT::Q6RY99
Residue:512
BDBM50023573
NameBDBM50023573
Synonyms:4-Cyclohexyl-4-hydroxy-but-2-enoic acid | CHEMBL171331
TypeSmall organic molecule
Emp. Form.C10H16O3
Mol. Mass.184.2322
SMILESOC(\C=C\C(O)=O)C1CCCCC1