Reaction Details
TargetGamma-hydroxybutyrate receptor
LigandBDBM50023574
Substrate/Competitorn/a
Meas. Tech.ChEBML_68885
IC50 11±n/a nM
Citation Bourguignon, JJSchoenfelder, ASchmitt, MWermuth, CGHechler, VCharlier, BMaitre, M Analogues of gamma-hydroxybutyric acid. Synthesis and binding studies. J Med Chem31:893-7 (1988) Gamma-hydroxybutyrate receptor
Name:Gamma-hydroxybutyrate receptor
Type:Enzyme Catalytic Domain
Mol. Mass.:56171.11
Organism:RAT
Description:Gamma hydroxybutyric, GHB 0 RAT::Q6RY99
Residue:512
BDBM50023574
NameBDBM50023574
Synonyms:4-Hydroxy-pent-2-enoic acid | CHEMBL171595
TypeSmall organic molecule
Emp. Form.C5H8O3
Mol. Mass.116.1152
SMILESCC(O)\C=C\C(O)=O